circleci execut test

[CircleCI] Failed to execute goal org.apache.maven.plugins:maven-surefire-plugin:2.22.2:test

Falha ao executar os testes com o CircleCI: Failed to execute goal org.apache.maven.plugins:maven-surefire-plugin:2.22.2:test org.apache.maven.surefire.booter.SurefireBooterForkException: The forked VM terminated without properly saying goodbye. VM crash or System.exit called at org.apache.maven.plugin.surefire.booterclient.ForkStarter.fork(ForkStarter.java:669) Stack do erro: [INFO] BUILD FAILURE [INFO] ———————————————————————— [INFO] Total time: 2.569 s [INFO] Finished at: 2019-05-23T12:49:29Z [INFO] ———————————————————————— [ERROR] Failed to execute goal org.apache.maven.plugins:maven-surefire-plugin:2.22.2:test (default-test) […]

Rolar para o topo